Reaction Details
TargetTyrosine-protein kinase JAK1
LigandBDBM255010
Substrate/Competitorn/a
Meas. Tech.Enzyme Assay
IC50 1.4±n/a nM
Citation Takahashi, KWatanabe, THayashi, KKurihara, KNakamura, TYamamoto, ANishimura, TKamiyama, THidaka, Y Tricyclic pyrrolopyridine compound, and JAK inhibitor US Patent US9475813 Publication Date 10/25/2016
 
Tyrosine-protein kinase JAK1
Name:Tyrosine-protein kinase JAK1
Type:Protein
Mol. Mass.:133293.73
Organism:Homo sapiens (Human)
Description:P23458
Residue:1154
BDBM255010
NameBDBM255010
Synonyms:US9475813, 15
TypeSmall organic molecule
Emp. Form.C20H24F3N5O
Mol. Mass.407.4327
SMILESFC(F)(F)C1(CC1)NC[C@H]1CC[C@@H](CC1)N1CNC(=O)c2cnc3[nH]ccc3c12