Reaction Details
TargetTyrosine-protein kinase JAK1
LigandBDBM255027
Substrate/Competitorn/a
Meas. Tech.Enzyme Assay
IC50 4.1±n/a nM
Citation Takahashi, KWatanabe, THayashi, KKurihara, KNakamura, TYamamoto, ANishimura, TKamiyama, THidaka, Y Tricyclic pyrrolopyridine compound, and JAK inhibitor US Patent US9475813 Publication Date 10/25/2016
 
Tyrosine-protein kinase JAK1
Name:Tyrosine-protein kinase JAK1
Type:Protein
Mol. Mass.:133293.73
Organism:Homo sapiens (Human)
Description:P23458
Residue:1154
BDBM255027
NameBDBM255027
Synonyms:US9475813, 32
TypeSmall organic molecule
Emp. Form.C21H29N5O3S
Mol. Mass.431.552
SMILESCN(C[C@H]1CC[C@@H](CC1)N1CN(C2CC2)C(=O)c2cnc3[nH]ccc3c12)S(C)(=O)=O