Reaction Details
TargetTyrosine-protein kinase JAK2
LigandBDBM254982
Substrate/Competitorn/a
Meas. Tech.Enzyme Assay
IC50 0.62±n/a nM
Citation Takahashi, KWatanabe, THayashi, KKurihara, KNakamura, TYamamoto, ANishimura, TKamiyama, THidaka, Y Tricyclic pyrrolopyridine compound, and JAK inhibitor US Patent US9475813 Publication Date 10/25/2016
 
Tyrosine-protein kinase JAK2
Name:Tyrosine-protein kinase JAK2
Type:Protein
Mol. Mass.:130684.68
Organism:Homo sapiens (Human)
Description:O60674
Residue:1132
BDBM254982
NameBDBM254982
Synonyms:US9475813, 38
TypeSmall organic molecule
Emp. Form.C20H27N5O3S
Mol. Mass.417.525
SMILESCN1CN([C@H]2CC[C@H](CN3CCCS3(=O)=O)CC2)c2c(cnc3[nH]ccc23)C1=O