Reaction Details
TargetTyrosine-protein kinase JAK2
LigandBDBM254996
Substrate/Competitorn/a
Meas. Tech.Enzyme Assay
IC50 4.6±n/a nM
Citation Takahashi, KWatanabe, THayashi, KKurihara, KNakamura, TYamamoto, ANishimura, TKamiyama, THidaka, Y Tricyclic pyrrolopyridine compound, and JAK inhibitor US Patent US9475813 Publication Date 10/25/2016
 
Tyrosine-protein kinase JAK2
Name:Tyrosine-protein kinase JAK2
Type:Protein
Mol. Mass.:130684.68
Organism:Homo sapiens (Human)
Description:O60674
Residue:1132
BDBM254996
NameBDBM254996
Synonyms:US9475813, 66
TypeSmall organic molecule
Emp. Form.C19H24F3N5O
Mol. Mass.395.422
SMILESCN(C[C@H]1CC[C@@H](CC1)N1CNC(=O)c2cnc3[nH]ccc3c12)CC(F)(F)F