Reaction Details
TargetCasein kinase I isoform epsilon
LigandBDBM255164
Substrate/Competitorn/a
Meas. Tech.Kinase Assay
pH7.4±n/a
Temperature298.15±n/a K
IC50 0.2±n/a nM
Commentsextracted
Citation Velaparthi, UDarne, CPDodd, DSLiu, PMussari, CPWittman, MDKumaravel, SMullick, D Pyrazole substituted imidazopyrazines as casein kinase 1 d/e inhibitors US Patent US9475817 Publication Date 10/25/2016
 
Casein kinase I isoform epsilon
Name:Casein kinase I isoform epsilon
Type:Protein
Mol. Mass.:47340.25
Organism:Homo sapiens (Human)
Description:P49674
Residue:416
BDBM255164
NameBDBM255164
Synonyms:US9475817, 123
TypeSmall organic molecule
Emp. Form.C28H26F2N10O2
Mol. Mass.572.5686
SMILESCn1nc(c(c1N1CCN(CC1)C(=O)CN)-c1ccc2nc(NC(=O)c3ccnc(F)c3)cn2n1)-c1ccc(F)cc1