Reaction Details
TargetCasein kinase I isoform delta
LigandBDBM255158
Substrate/Competitorn/a
Meas. Tech.Kinase Assay
pH7.4±n/a
Temperature298.15±n/a K
IC50 0.1±n/a nM
Commentsextracted
Citation Velaparthi, UDarne, CPDodd, DSLiu, PMussari, CPWittman, MDKumaravel, SMullick, D Pyrazole substituted imidazopyrazines as casein kinase 1 d/e inhibitors US Patent US9475817 Publication Date 10/25/2016
 
Casein kinase I isoform delta
Name:Casein kinase I isoform delta
Type:Enzyme
Mol. Mass.:47356.76
Organism:Homo sapiens (Human)
Description:P48730
Residue:415
BDBM255158
NameBDBM255158
Synonyms:US9475817, 117
TypeSmall organic molecule
Emp. Form.C28H27F2N9O2
Mol. Mass.559.5699
SMILESCn1nc(c(c1N1CCN(CCO)CC1)-c1ccc2nc(NC(=O)c3ccnc(F)c3)cn2n1)-c1ccc(F)cc1