Reaction Details
TargetTyrosine-protein kinase BTK
LigandBDBM255340
Substrate/Competitorn/a
Meas. Tech.LANCE (Lanthanide Chelate Excite) TR-FRET (Time-resolved fluorescence resonance energy transfer) Assay
IC50 0.18±n/a nM
Citation Kim, RMLiu, JGao, XBoga, SBGuiadeen, DKozlowski, JAYu, WAnand, RYu, YSelyutin, OBGao, YWu, HLiu, SYang, CWang, H Substituted benzamides and substituted pyridinecarboxamides as Btk inhibitors US Patent US9481682 Publication Date 11/1/2016
 
Tyrosine-protein kinase BTK
Name:Tyrosine-protein kinase BTK
Type:Enzyme
Mol. Mass.:76289.95
Organism:Homo sapiens (Human)
Description:Q06187
Residue:659
BDBM255340
NameBDBM255340
Synonyms:US9481682, 90
TypeSmall organic molecule
Emp. Form.C29H28F3N7O4
Mol. Mass.595.5723
SMILESCOc1cc(ccc1-c1nc([C@@H]2CC[C@@H]3N(C2)C(=O)OC3(C)C)n2ccnc(N)c12)C(=O)Nc1cc(ccn1)C(F)(F)F