Reaction Details
TargetTyrosine-protein kinase BTK
LigandBDBM255352
Substrate/Competitorn/a
Meas. Tech.LANCE (Lanthanide Chelate Excite) TR-FRET (Time-resolved fluorescence resonance energy transfer) Assay
IC50 0.21±n/a nM
Citation Kim, RMLiu, JGao, XBoga, SBGuiadeen, DKozlowski, JAYu, WAnand, RYu, YSelyutin, OBGao, YWu, HLiu, SYang, CWang, H Substituted benzamides and substituted pyridinecarboxamides as Btk inhibitors US Patent US9481682 Publication Date 11/1/2016
 
Tyrosine-protein kinase BTK
Name:Tyrosine-protein kinase BTK
Type:Enzyme
Mol. Mass.:76289.95
Organism:Homo sapiens (Human)
Description:Q06187
Residue:659
BDBM255352
NameBDBM255352
Synonyms:US9481682, 102
TypeSmall organic molecule
Emp. Form.C33H28F3N9O3
Mol. Mass.655.6291
SMILESNc1nccn2c(nc(-c3ccc(cc3)C(=O)Nc3cc(ccn3)C(F)(F)F)c12)[C@@H]1CC[C@H]2CN(CC(=O)N2C1)C(=O)c1ccncc1