Reaction Details
TargetTyrosine-protein kinase BTK
LigandBDBM255466
Substrate/Competitorn/a
Meas. Tech.LANCE (Lanthanide Chelate Excite) TR-FRET (Time-resolved fluorescence resonance energy transfer) Assay
IC50 0.17±n/a nM
Citation Kim, RMLiu, JGao, XBoga, SBGuiadeen, DKozlowski, JAYu, WAnand, RYu, YSelyutin, OBGao, YWu, HLiu, SYang, CWang, H Substituted benzamides and substituted pyridinecarboxamides as Btk inhibitors US Patent US9481682 Publication Date 11/1/2016
 
Tyrosine-protein kinase BTK
Name:Tyrosine-protein kinase BTK
Type:Enzyme
Mol. Mass.:76289.95
Organism:Homo sapiens (Human)
Description:Q06187
Residue:659
BDBM255466
NameBDBM255466
Synonyms:US9481682, 217
TypeSmall organic molecule
Emp. Form.C28H24ClF4N7O3
Mol. Mass.617.982
SMILESCOc1cc(cc(F)c1-c1nc([C@@H]2CC[C@H]3CCC(=O)N3C2)n2c(Cl)cnc(N)c12)C(=O)Nc1cc(ccn1)C(F)(F)F