Reaction Details
TargetTyrosine-protein kinase SYK
LigandBDBM255485
Substrate/Competitorn/a
Meas. Tech.Biochemical Assay
pH7.4±n/a
Temperature298.15±n/a K
IC50 61.5±n/a nM
Commentsextracted
Citation Singh, RArgade, APayan, DGMolineaux, SHolland, SJClough, JKeim, HBhamidipati, SSylvain, CLi, HRossi, AB 2,4-pyrimidinediamine compounds and their uses US Patent US9499493 Publication Date 11/22/2016
 
Tyrosine-protein kinase SYK
Name:Tyrosine-protein kinase SYK
Type:Enzyme
Mol. Mass.:72079.99
Organism:Homo sapiens (Human)
Description:P43405
Residue:635
BDBM255485
NameBDBM255485
Synonyms:US10828301, Compound R926816 | US9499493, R926816
TypeSmall organic molecule
Emp. Form.C21H20FN5O4
Mol. Mass.425.413
SMILESCNC(=O)COc1cccc(Nc2ncc(F)c(Nc3ccc4OCCOc4c3)n2)c1