Reaction Details
TargetTyrosine-protein kinase SYK
LigandBDBM255510
Substrate/Competitorn/a
Meas. Tech.Biochemical Assay
pH7.4±n/a
Temperature298.15±n/a K
IC50 57±n/a nM
Commentsextracted
Citation Singh, RArgade, APayan, DGMolineaux, SHolland, SJClough, JKeim, HBhamidipati, SSylvain, CLi, HRossi, AB 2,4-pyrimidinediamine compounds and their uses US Patent US9499493 Publication Date 11/22/2016
 
Tyrosine-protein kinase SYK
Name:Tyrosine-protein kinase SYK
Type:Enzyme
Mol. Mass.:72079.99
Organism:Homo sapiens (Human)
Description:P43405
Residue:635
BDBM255510
NameBDBM255510
Synonyms:US10828301, Compound R935307 | US9499493, R935307
TypeSmall organic molecule
Emp. Form.C23H25FN6O2
Mol. Mass.436.482
SMILESCC(C)Oc1ccc(Nc2nc(Nc3ccc4n(CCCO)ncc4c3)ncc2F)cc1