Reaction Details
TargetTyrosine-protein kinase SYK
LigandBDBM255524
Substrate/Competitorn/a
Meas. Tech.Biochemical Assay
pH7.4±n/a
Temperature298.15±n/a K
IC50 0.45±n/a nM
Commentsextracted
Citation Singh, RArgade, APayan, DGMolineaux, SHolland, SJClough, JKeim, HBhamidipati, SSylvain, CLi, HRossi, AB 2,4-pyrimidinediamine compounds and their uses US Patent US9499493 Publication Date 11/22/2016
 
Tyrosine-protein kinase SYK
Name:Tyrosine-protein kinase SYK
Type:Enzyme
Mol. Mass.:72079.99
Organism:Homo sapiens (Human)
Description:P43405
Residue:635
BDBM255524
NameBDBM255524
Synonyms:N4-[(2,2-Difluoro-4H-benzo[1,4]oxazin-3-one)-6-yl]-5-fluoro-N2-[3-(methylaminocarbonylmethyleneoxy)phenyl]-2,4-pyrimidinediamine | US9499493, R921303
TypeSmall organic molecule
Emp. Form.C22H21F3N6O4
Mol. Mass.490.4351
SMILESCNC(=O)COC1=C(C)CCC(Nc2ncc(F)c(Nc3ccc4OC(F)(F)C(=O)Nc4c3)n2)=C1