Reaction Details
TargetcAMP-specific 3',5'-cyclic phosphodiesterase 4B
LigandBDBM120844
Substrate/Competitorn/a
Meas. Tech.Inhibition Assay
pH7.5±n/a
IC50 5.2±n/a nM
Commentsextracted
Citation Jarnagin, KAkama, T Boron containing small molecules US Patent US9499570 Publication Date 11/22/2016
 
cAMP-specific 3',5'-cyclic phosphodiesterase 4B
Name:cAMP-specific 3',5'-cyclic phosphodiesterase 4B
Type:Protein
Mol. Mass.:83318.87
Organism:Homo sapiens (Human)
Description:Q07343
Residue:736
BDBM120844
NameBDBM120844
Synonyms:US8716478, D230 US9499570, D230
TypeSmall organic molecule
Emp. Form.C18H18BClN2O5
Mol. Mass.388.61
SMILESCC(C)OCCOc1nc(Oc2ccc3B(O)OCc3c2)c(Cl)cc1C#N