Reaction Details
TargetcAMP-specific 3',5'-cyclic phosphodiesterase 4B
LigandBDBM120856
Substrate/Competitorn/a
Meas. Tech.Inhibition Assay
pH7.5±n/a
IC50 2.2±n/a nM
Commentsextracted
Citation Jarnagin, KAkama, T Boron containing small molecules US Patent US9499570 Publication Date 11/22/2016
 
cAMP-specific 3',5'-cyclic phosphodiesterase 4B
Name:cAMP-specific 3',5'-cyclic phosphodiesterase 4B
Type:Protein
Mol. Mass.:83318.87
Organism:Homo sapiens (Human)
Description:Q07343
Residue:736
BDBM120856
NameBDBM120856
Synonyms:US8716478, D242 | US9499570, D242
TypeSmall organic molecule
Emp. Form.C19H16BF3N2O5
Mol. Mass.420.147
SMILESCC(=O)CCCOc1nc(Oc2ccc3B(O)OCc3c2)cc(c1C#N)C(F)(F)F