Reaction Details
TargetcAMP-specific 3',5'-cyclic phosphodiesterase 4B
LigandBDBM120859
Substrate/Competitorn/a
Meas. Tech.Inhibition Assay
pH7.5±n/a
IC50 2.0±n/a nM
Commentsextracted
Citation Jarnagin, KAkama, T Boron containing small molecules US Patent US9499570 Publication Date 11/22/2016
 
cAMP-specific 3',5'-cyclic phosphodiesterase 4B
Name:cAMP-specific 3',5'-cyclic phosphodiesterase 4B
Type:Protein
Mol. Mass.:83318.87
Organism:Homo sapiens (Human)
Description:Q07343
Residue:736
BDBM120859
NameBDBM120859
Synonyms:US8716478, D245 | US9499570, D245
TypeSmall organic molecule
Emp. Form.C19H20BClN2O5
Mol. Mass.402.636
SMILESCC(C)OCCOc1nc(Oc2cc3COB(O)c3c(C)c2)c(Cl)cc1C#N