Reaction Details
TargetcAMP-specific 3',5'-cyclic phosphodiesterase 4B
LigandBDBM120860
Substrate/Competitorn/a
Meas. Tech.Inhibition Assay
pH7.5±n/a
IC50 1.3±n/a nM
Commentsextracted
Citation Jarnagin, KAkama, T Boron containing small molecules US Patent US9499570 Publication Date 11/22/2016
 
cAMP-specific 3',5'-cyclic phosphodiesterase 4B
Name:cAMP-specific 3',5'-cyclic phosphodiesterase 4B
Type:Protein
Mol. Mass.:83318.87
Organism:Homo sapiens (Human)
Description:Q07343
Residue:736
BDBM120860
NameBDBM120860
Synonyms:US8716478, D246 | US9499570, D246
TypeSmall organic molecule
Emp. Form.C19H18BClN2O5
Mol. Mass.400.621
SMILESCC(=O)CCCOc1nc(Oc2cc3COB(O)c3c(C)c2)c(Cl)cc1C#N