Reaction Details
Targetchymase
LigandBDBM255958
Substrate/Competitorn/a
Meas. Tech.Enzymatic Chymase Assay
pH7.5±n/a
IC50 2±n/a nM
Commentsextracted
Citation Fürstner, CAckerstaff, JStraub, AMeier, HTinel, HZimmermann, KTersteegen, AZubov, DKast, RSchamberger, JSchäfer, MBörngen, K Bicyclically substituted uracils and the use thereof US Patent US9481672 Publication Date 11/1/2016
 
chymase
Name:chymase
Synonyms:n/a
Type:Enzyme
Mol. Mass.:27507.42
Organism:Mesocricetus auratus (Golden hamster)
Description:A0A1U7QTH6
Residue:247
BDBM255958
NameBDBM255958
Synonyms:US9481672, 136
TypeSmall organic molecule
Emp. Form.C25H23F3N4O5
Mol. Mass.516.4691
SMILESCCn1c2ccc(cc2n(CC)c1=O)-n1cc(C(O)=O)c(=O)n(Cc2cccc(c2C)C(F)(F)F)c1=O