Reaction Details
Targetchymase
LigandBDBM255966
Substrate/Competitorn/a
Meas. Tech.Enzymatic Chymase Assay
pH7.5±n/a
IC50 2±n/a nM
Commentsextracted
Citation Fürstner, CAckerstaff, JStraub, AMeier, HTinel, HZimmermann, KTersteegen, AZubov, DKast, RSchamberger, JSchäfer, MBörngen, K Bicyclically substituted uracils and the use thereof US Patent US9481672 Publication Date 11/1/2016
 
chymase
Name:chymase
Synonyms:n/a
Type:Enzyme
Mol. Mass.:27507.42
Organism:Mesocricetus auratus (Golden hamster)
Description:A0A1U7QTH6
Residue:247
BDBM255966
NameBDBM255966
Synonyms:US9481672, 144
TypeSmall organic molecule
Emp. Form.C24H18F6N4O5
Mol. Mass.556.4139
SMILESCc1c(Cn2c(=O)c(cn(-c3ccc4n(C)c(=O)n(CC(F)(F)F)c4c3)c2=O)C(O)=O)cccc1C(F)(F)F