Reaction Details
Targetchymase
LigandBDBM256099
Substrate/Competitorn/a
Meas. Tech.Enzymatic Chymase Assay
pH7.5±n/a
IC50 1±n/a nM
Commentsextracted
Citation Fürstner, CAckerstaff, JStraub, AMeier, HTinel, HZimmermann, KTersteegen, AZubov, DKast, RSchamberger, JSchäfer, MBörngen, K Bicyclically substituted uracils and the use thereof US Patent US9481672 Publication Date 11/1/2016
 
chymase
Name:chymase
Synonyms:n/a
Type:Enzyme
Mol. Mass.:27507.42
Organism:Mesocricetus auratus (Golden hamster)
Description:A0A1U7QTH6
Residue:247
BDBM256099
NameBDBM256099
Synonyms:US9481672, 281
TypeSmall organic molecule
Emp. Form.C25H21F3N4O5
Mol. Mass.514.4532
SMILESCn1c2ccc(cc2n(C)c1=O)-n1cc(C(O)=O)c(=O)n([C@@H]2CCCc3c2cccc3C(F)(F)F)c1=O