Reaction Details
Targetchymase
LigandBDBM256116
Substrate/Competitorn/a
Meas. Tech.Enzymatic Chymase Assay
pH7.5±n/a
IC50 2±n/a nM
Commentsextracted
Citation Fürstner, CAckerstaff, JStraub, AMeier, HTinel, HZimmermann, KTersteegen, AZubov, DKast, RSchamberger, JSchäfer, MBörngen, K Bicyclically substituted uracils and the use thereof US Patent US9481672 Publication Date 11/1/2016
 
chymase
Name:chymase
Synonyms:n/a
Type:Enzyme
Mol. Mass.:27507.42
Organism:Mesocricetus auratus (Golden hamster)
Description:A0A1U7QTH6
Residue:247
BDBM256116
NameBDBM256116
Synonyms:US9481672, 300
TypeSmall organic molecule
Emp. Form.C24H18F3N3O5S
Mol. Mass.517.477
SMILESCn1c2ccc(cc2sc1=O)-n1cc(C(O)=O)c(=O)n([C@@H]2CCCc3c2cccc3C(F)(F)F)c1=O