Reaction Details
TargetInterstitial collagenase
LigandBDBM50062351
Substrate/Competitorn/a
Meas. Tech.Activity Assay
pH7.5±n/a
Temperature310.15±n/a K
IC50 0.5±n/a nM
Commentsextracted
Citation Ferdinandy, PCsont, TBCsonka, CKedvesné Kupai, KKovács, LKis-Tamás, ATakács, FTKónya, DMedgyes, GCseh, SHajdú, ILörincz, ZDormán, GGörbe, A Inhibitors of matrix metalloproteinases US Patent US9487462 Publication Date 11/8/2016
 
Interstitial collagenase
Name:Interstitial collagenase
Type:Enzyme
Mol. Mass.:54010.26
Organism:Homo sapiens (Human)
Description: P03956
Residue:469
BDBM50062351
NameBDBM50062351
Synonyms:(R)-N*4*-Hydroxy-N*1*-[(S)-2-(1H-indol-3-yl)-1-methylcarbamoyl-ethyl]-2-isobutyl-succinamide (R)-N1-((S)-3-(1H-indol-3-yl)-1-(methylamino)-1-oxopropan-2-yl)-N4-hydroxy-2-isobutylsuccinamide CHEMBL19611 US9487462, ilomastat
TypeSmall organic molecule
Emp. Form.C20H28N4O4
Mol. Mass.388.4607
SMILESCNC(=O)[C@H](Cc1c[nH]c2ccccc12)NC(=O)[C@H](CC(C)C)CC(=O)NO