Reaction Details
TargetIsoform 2 of Nuclear receptor ROR-gamma (RORgT)
LigandBDBM256345
Substrate/Competitorn/a
Meas. Tech.TR-FRET Assay
pH7±n/a
Temperature277.15±n/a K
IC50 14±n/a nM
Commentsextracted
Citation Barr, KJMaclean, JKZhang, HBeresis, RTZhang, DAndresen, BMAnthony, NJLapointe, BTSciammetta, N 3-cyclohexenyl and cyclohexyl substituted indole and indazole compounds as RORgammaT inhibitors and uses thereof US Patent US9487490 Publication Date 11/8/2016
 
Isoform 2 of Nuclear receptor ROR-gamma (RORgT)
Name:Isoform 2 of Nuclear receptor ROR-gamma (RORgT)
Type:Protein
Mol. Mass.:55831.73
Organism:Homo sapiens (Human)
Description:P51449-2
Residue:497
BDBM256345
NameBDBM256345
Synonyms:US9487490, 1I
TypeSmall organic molecule
Emp. Form.C23H17Cl2F3N2O3
Mol. Mass.497.294
SMILESCC1(CCC(=CC1)c1nn(C(=O)c2c(Cl)cccc2C(F)(F)F)c2cccc(Cl)c12)C(O)=O