Reaction Details
TargetIsoform 2 of Nuclear receptor ROR-gamma (RORgT)
LigandBDBM256347
Substrate/Competitorn/a
Meas. Tech.TR-FRET Assay
pH7±n/a
Temperature277.15±n/a K
IC50 31±n/a nM
Commentsextracted
Citation Barr, KJMaclean, JKZhang, HBeresis, RTZhang, DAndresen, BMAnthony, NJLapointe, BTSciammetta, N 3-cyclohexenyl and cyclohexyl substituted indole and indazole compounds as RORgammaT inhibitors and uses thereof US Patent US9487490 Publication Date 11/8/2016
 
Isoform 2 of Nuclear receptor ROR-gamma (RORgT)
Name:Isoform 2 of Nuclear receptor ROR-gamma (RORgT)
Type:Protein
Mol. Mass.:55831.73
Organism:Homo sapiens (Human)
Description:P51449-2
Residue:497
BDBM256347
NameBDBM256347
Synonyms:US9487490, 1K
TypeSmall organic molecule
Emp. Form.C22H18ClFN2O3
Mol. Mass.412.841
SMILESCc1cccc(Cl)c1C(=O)n1nc(C2=CCC(CC2)C(O)=O)c2c(F)cccc12