Reaction Details
TargetIsoform 2 of Nuclear receptor ROR-gamma (RORgT)
LigandBDBM256359
Substrate/Competitorn/a
Meas. Tech.TR-FRET Assay
pH7±n/a
Temperature277.15±n/a K
IC50 6±n/a nM
Commentsextracted
Citation Barr, KJMaclean, JKZhang, HBeresis, RTZhang, DAndresen, BMAnthony, NJLapointe, BTSciammetta, N 3-cyclohexenyl and cyclohexyl substituted indole and indazole compounds as RORgammaT inhibitors and uses thereof US Patent US9487490 Publication Date 11/8/2016
 
Isoform 2 of Nuclear receptor ROR-gamma (RORgT)
Name:Isoform 2 of Nuclear receptor ROR-gamma (RORgT)
Type:Protein
Mol. Mass.:55831.73
Organism:Homo sapiens (Human)
Description:P51449-2
Residue:497
BDBM256359
NameBDBM256359
Synonyms:US9487490, 4G
TypeSmall organic molecule
Emp. Form.C28H25ClF3N3O4
Mol. Mass.559.964
SMILESC[C@H]1CCCN1C(=O)c1ccc2c(nn(C(=O)c3c(Cl)cccc3C(F)(F)F)c2c1)C1=CCC(CC1)C(O)=O