Reaction Details
TargetAmine oxidase [flavin-containing] B
LigandBDBM256460
Substrate/Competitorn/a
Meas. Tech.Biological Assay
pH7.5±n/a
Temperature310.15±n/a K
Ki 5500±n/a nM
Commentsextracted
Citation Ortega Muñoz, AFyfe, MCMartinell Pedemonte, MEstiarte Martinez, MValls Vidal, NKurz, GCastro Palomino Laria, JC (Hetero)aryl cyclopropylamine compounds as LSD1 inhibitors US Patent US9487512 Publication Date 11/8/2016
 
Amine oxidase [flavin-containing] B
Name:Amine oxidase [flavin-containing] B
Type:Protein
Mol. Mass.:58768.76
Organism:Homo sapiens (Human)
Description:P27338
Residue:520
BDBM256460
NameBDBM256460
Synonyms:US9487512, 4
TypeSmall organic molecule
Emp. Form.C21H26N2O
Mol. Mass.322.4439
SMILESC(Oc1ccc(cc1)[C@@H]1C[C@H]1NC1CCNCC1)c1ccccc1