Reaction Details
TargetAmine oxidase [flavin-containing] B
LigandBDBM256461
Substrate/Competitorn/a
Meas. Tech.Biological Assay
pH7.5±n/a
Temperature310.15±n/a K
Ki 55000±n/a nM
Commentsextracted
Citation Ortega Muñoz, AFyfe, MCMartinell Pedemonte, MEstiarte Martinez, MValls Vidal, NKurz, GCastro Palomino Laria, JC (Hetero)aryl cyclopropylamine compounds as LSD1 inhibitors US Patent US9487512 Publication Date 11/8/2016
 
Amine oxidase [flavin-containing] B
Name:Amine oxidase [flavin-containing] B
Type:Protein
Mol. Mass.:58768.76
Organism:Homo sapiens (Human)
Description:P27338
Residue:520
BDBM256461
NameBDBM256461
Synonyms:US10329256, Example 6 US9944601, Example 6
TypeSmall organic molecule
Emp. Form.C16H24N2
Mol. Mass.244.3752
SMILESC(CC1CCNCC1)N[C@H]1C[C@@H]1c1ccccc1