Reaction Details
TargetBeta-secretase 1
LigandBDBM256761
Substrate/Competitorn/a
Meas. Tech.HTRF FRET Assay
pH5±n/a
Temperature303.15±n/a K
Ki 1±n/a nM
Commentsextracted
Citation Cumming, JNKaelin, Jr., DEScott, JDStamford, AWIserloh, U C6-azaspiro iminothiadiazine dioxides as bace inhibitors, compositions, and their use US Patent US9489013 Publication Date 11/8/2016
 
Beta-secretase 1
Name:Beta-secretase 1
Type:Protein
Mol. Mass.:55755.10
Organism:Homo sapiens (Human)
Description:P56817
Residue:501
BDBM256761
NameBDBM256761
Synonyms:US9489013, 32
TypeSmall organic molecule
Emp. Form.C25H30F2N6O4S
Mol. Mass.548.605
SMILESCN1C(=N)N[C@](C)(c2cc(NC(=O)c3ccc(F)cn3)ccc2F)[C@]2(CCN(CC3CCOC3)C2)S1(=O)=O