Reaction Details
TargetBeta-secretase 1
LigandBDBM256789
Substrate/Competitorn/a
Meas. Tech.HTRF FRET Assay
pH5±n/a
Temperature303.15±n/a K
Ki 1±n/a nM
Commentsextracted
Citation Cumming, JNKaelin, Jr., DEScott, JDStamford, AWIserloh, U C6-azaspiro iminothiadiazine dioxides as bace inhibitors, compositions, and their use US Patent US9489013 Publication Date 11/8/2016
 
Beta-secretase 1
Name:Beta-secretase 1
Type:Protein
Mol. Mass.:55755.10
Organism:Homo sapiens (Human)
Description:P56817
Residue:501
BDBM256789
NameBDBM256789
Synonyms:US9489013, 60
TypeSmall organic molecule
Emp. Form.C24H29FN6O6S2
Mol. Mass.580.652
SMILESCOc1ccc(nc1)C(=O)Nc1ccc(F)c(c1)[C@@]1(C)NC(=N)N(C)S(=O)(=O)[C@@]11CCN(C1)S(=O)(=O)C1CC1