Reaction Details
TargetBeta-secretase 2
LigandBDBM256742
Substrate/Competitorn/a
Meas. Tech.Time-Resolved Endpoint proteolysis Assay
pH5±n/a
Temperature303.15±n/a K
Ki 1±n/a nM
Commentsextracted
Citation Cumming, JNKaelin, Jr., DEScott, JDStamford, AWIserloh, U C6-azaspiro iminothiadiazine dioxides as bace inhibitors, compositions, and their use US Patent US9489013 Publication Date 11/8/2016
 
Beta-secretase 2
Name:Beta-secretase 2
Type:Protein
Mol. Mass.:56171.20
Organism:Homo sapiens (Human)
Description:Q9Y5Z0
Residue:518
BDBM256742
NameBDBM256742
Synonyms:US9489013, 13
TypeSmall organic molecule
Emp. Form.C24H28F4N6O4S
Mol. Mass.572.576
SMILESCOc1ccc(nc1)C(=O)Nc1ccc(F)c(c1)[C@@]1(C)NC(=N)N(C)S(=O)(=O)[C@@]11CCN(CCC(F)(F)F)C1