Reaction Details
TargetRAC-alpha serine/threonine-protein kinase
LigandBDBM256836
Substrate/Competitorn/a
Meas. Tech.In Vitro AKT1 Kinase Assay
pH7.5±n/a
Temperature298.15±n/a K
IC50 3.2±n/a nM
Commentsextracted
Citation Johnson, PDLeach, ALuke, RWMatusiak, ZSMorris, JJ Protein kinase B inhibitors US Patent US9492453 Publication Date 11/15/2016
 
RAC-alpha serine/threonine-protein kinase
Name:RAC-alpha serine/threonine-protein kinase
Type:Enzyme
Mol. Mass.:55681.25
Organism:Homo sapiens (Human)
Description:P31749
Residue:480
BDBM256836
NameBDBM256836
Synonyms:BDBM50427349 US11236095, Example 15 | US9492453, 15
TypeSmall organic molecule
Emp. Form.C21H25ClN6O2
Mol. Mass.428.915
SMILESNC1(CCN(CC1)c1ncnc2[nH]ccc12)C(=O)N[C@H](CCO)c1ccc(Cl)cc1