Reaction Details
TargetLeucine-rich repeat serine/threonine-protein kinase 2 [970-2527,G2019S]
LigandBDBM257184
Substrate/Competitorn/a
Meas. Tech.Km ATP LanthaScreen Assay
pH8.5±n/a
Temperature298.15±n/a K
IC50<0.6±n/a nM
Commentsextracted
Citation Miller, MBasu, KDeMong, DScott, JLi, WStamford, APoirer, MTempest, P Compounds inhibiting leucine-rich repeat kinase enzyme activity US Patent US9493440 Publication Date 11/15/2016
 
Leucine-rich repeat serine/threonine-protein kinase 2 [970-2527,G2019S]
Name:Leucine-rich repeat serine/threonine-protein kinase 2 [970-2527,G2019S]
Type:Protein
Mol. Mass.:177347.59
Organism:Homo sapiens (Human)
Description:Human LRRK2 variant (970-2527aa) with G2019S mutation
Residue:1558
BDBM257184
NameBDBM257184
Synonyms:BDBM257386 | US9493440, 26
TypeSmall organic molecule
Emp. Form.C21H26N6O
Mol. Mass.378.4707
SMILESC[C@H]1CN(CCN1C)c1cc(ncn1)-c1n[nH]c2ccc(OC3(C)CC3)cc12