Reaction Details
TargetTyrosine-protein kinase SYK
LigandBDBM212274
Substrate/Competitorn/a
Meas. Tech.Time-Resolved Fluorescence Resonance Energy Transfer (TR-FRET) Immunoassay
pH7±n/a
Temperature298.15±n/a K
IC50 12.2±n/a nM
Commentsextracted
Citation Blomgren, PAClarke, ACurrie, KSDi Paolo, JKropf, JELee, SHLo, JRMitchell, SASchmitt, ACSwaminathan, SXiong, JXu, JZhao, Z Syk inhibitors US Patent US9504684 Publication Date 11/29/2016
 
Tyrosine-protein kinase SYK
Name:Tyrosine-protein kinase SYK
Type:Enzyme
Mol. Mass.:72079.99
Organism:Homo sapiens (Human)
Description:P43405
Residue:635
BDBM212274
NameBDBM212274
Synonyms:2-(5-((6-(6-aminopyrazin-2-yl)imidazo[1,2-a]pyrazin-8-yl)amino)-2-(4-(oxetan-3-yl)piperazin-1-yl)phenoxy)ethanol US10828299, Example Ex.-5 US9290505, Ex.-5 US9931338, Ex.-5
TypeSmall organic molecule
Emp. Form.C25H29N9O3
Mol. Mass.503.5563
SMILESNc1cncc(n1)-c1cn2ccnc2c(Nc2ccc(N3CCN(CC3)C3COC3)c(OCCO)c2)n1