Reaction Details
TargetTyrosine-protein kinase SYK
LigandBDBM212279
Substrate/Competitorn/a
Meas. Tech.Time-Resolved Fluorescence Resonance Energy Transfer (TR-FRET) Immunoassay
pH7±n/a
Temperature298.15±n/a K
IC50 16±n/a nM
Commentsextracted
Citation Blomgren, PAClarke, ACurrie, KSDi Paolo, JKropf, JELee, SHLo, JRMitchell, SASchmitt, ACSwaminathan, SXiong, JXu, JZhao, Z Syk inhibitors US Patent US9504684 Publication Date 11/29/2016
 
Tyrosine-protein kinase SYK
Name:Tyrosine-protein kinase SYK
Type:Enzyme
Mol. Mass.:72079.99
Organism:Homo sapiens (Human)
Description:P43405
Residue:635
BDBM212279
NameBDBM212279
Synonyms:US11517570, Example Kn.-3: US9504684, 6-(5-amino-6-methylpyridin-3-yl)-N-(4-morpholinophenyl)imidazo[1,2-a]pyrazin-8-amine
TypeSmall organic molecule
Emp. Form.C22H23N7O
Mol. Mass.401.4643
SMILESCc1ncc(cc1N)-c1cn2ccnc2c(Nc2ccc(cc2)N2CCOCC2)n1