Reaction Details
TargetPeptidyl-prolyl cis-trans isomerase FKBP1A
LigandBDBM257513
Substrate/Competitorn/a
Meas. Tech.PPlase Assay
Ki 7.9±0.69 nM
Citation Gregory, MAKendrew, SGMoss, SJWilkinson, B Rapamycin analogues and their pharmaceutical use US Patent US9505773 Publication Date 11/29/2016
 
Peptidyl-prolyl cis-trans isomerase FKBP1A
Name:Peptidyl-prolyl cis-trans isomerase FKBP1A
Type:Isomerase
Mol. Mass.:11953.09
Organism:Homo sapiens (Human)
Description:P62942
Residue:108
BDBM257513
NameBDBM257513
Synonyms:US9505773, 5
TypeSmall organic molecule
Emp. Form.C46H71NO10
Mol. Mass.798.0566
SMILESCO[C@H]1C[C@@H]2CC[C@@H](C)[C@@](O)(O2)C(=O)C(=O)N2CCCC[C@H]2C(=O)OC(C\C=C(C)\[C@@H](O)CC(=O)[C@H](C)C[C@H](C)\C=C\C=C\C=C1/C)[C@H](C)C[C@H]1CC[C@H](O)CC1