Reaction Details
TargetSodium channel protein type 9 subunit alpha
LigandBDBM258106
Substrate/Competitorn/a
Meas. Tech.Electrophysiological Assay
pH7.3±n/a
Temperature310.15±n/a K
IC50 17±n/a nM
Commentsextracted
Citation Shinozuka, TKobayashi, HSuzuki, STanaka, KKimoto, HDomon, Y Cycloalkane derivatives US Patent US9493448 Publication Date 11/15/2016
 
Sodium channel protein type 9 subunit alpha
Name:Sodium channel protein type 9 subunit alpha
Type:Protein
Mol. Mass.:226375.97
Organism:Homo sapiens (Human)
Description:Q15858
Residue:1988
BDBM258106
NameBDBM258106
Synonyms:US9493448, 8 | US9845313, Example 8
TypeSmall organic molecule
Emp. Form.C17H17F2N5O3S2
Mol. Mass.441.475
SMILESCn1nccc1[C@H]1CCC[C@@H]1Oc1cc(F)c(cc1F)S(=O)(=O)Nc1ncns1