Reaction Details
TargetSodium channel protein type 9 subunit alpha
LigandBDBM258153
Substrate/Competitorn/a
Meas. Tech.Electrophysiological Assay
pH7.3±n/a
Temperature310.15±n/a K
IC50 39±n/a nM
Commentsextracted
Citation Shinozuka, TKobayashi, HSuzuki, STanaka, KKimoto, HDomon, Y Cycloalkane derivatives US Patent US9493448 Publication Date 11/15/2016
 
Sodium channel protein type 9 subunit alpha
Name:Sodium channel protein type 9 subunit alpha
Type:Protein
Mol. Mass.:226375.97
Organism:Homo sapiens (Human)
Description:Q15858
Residue:1988
BDBM258153
NameBDBM258153
Synonyms:US9493448, 55 | US9845313, Example 55
TypeSmall organic molecule
Emp. Form.C22H24N6O3S
Mol. Mass.452.529
SMILESCn1nccc1[C@H]1CCCCC[C@@H]1Oc1ccc(cc1C#N)S(=O)(=O)Nc1ccncn1