Reaction Details
TargetSodium channel protein type 9 subunit alpha
LigandBDBM258159
Substrate/Competitorn/a
Meas. Tech.Electrophysiological Assay
pH7.3±n/a
Temperature310.15±n/a K
IC50 2.6±n/a nM
Commentsextracted
Citation Shinozuka, TKobayashi, HSuzuki, STanaka, KKimoto, HDomon, Y Cycloalkane derivatives US Patent US9493448 Publication Date 11/15/2016
 
Sodium channel protein type 9 subunit alpha
Name:Sodium channel protein type 9 subunit alpha
Type:Protein
Mol. Mass.:226375.97
Organism:Homo sapiens (Human)
Description:Q15858
Residue:1988
BDBM258159
NameBDBM258159
Synonyms:US9493448, 61 | US9845313, Example 61
TypeSmall organic molecule
Emp. Form.C21H24FN5O3S
Mol. Mass.445.51
SMILESCCc1cc(c(F)cc1O[C@H]1CCC[C@@H]1c1ccnn1C)S(=O)(=O)Nc1ccncn1