Reaction Details
TargetSodium channel protein type 9 subunit alpha
LigandBDBM258165
Substrate/Competitorn/a
Meas. Tech.Electrophysiological Assay
pH7.3±n/a
Temperature310.15±n/a K
IC50 43±n/a nM
Commentsextracted
Citation Shinozuka, TKobayashi, HSuzuki, STanaka, KKimoto, HDomon, Y Cycloalkane derivatives US Patent US9493448 Publication Date 11/15/2016
 
Sodium channel protein type 9 subunit alpha
Name:Sodium channel protein type 9 subunit alpha
Type:Protein
Mol. Mass.:226375.97
Organism:Homo sapiens (Human)
Description:Q15858
Residue:1988
BDBM258165
NameBDBM258165
Synonyms:US9493448, 67 US9845313, Example 67
TypeSmall organic molecule
Emp. Form.C22H25F2N5O3S
Mol. Mass.477.527
SMILESCn1nccc1[C@H]1CC(C)(C)CC[C@@H]1Oc1cc(F)c(cc1F)S(=O)(=O)Nc1ccncn1