Reaction Details
TargetSodium channel protein type 9 subunit alpha
LigandBDBM258179
Substrate/Competitorn/a
Meas. Tech.Electrophysiological Assay
pH7.3±n/a
Temperature310.15±n/a K
IC50 36±n/a nM
Commentsextracted
Citation Shinozuka, TKobayashi, HSuzuki, STanaka, KKimoto, HDomon, Y Cycloalkane derivatives US Patent US9493448 Publication Date 11/15/2016
 
Sodium channel protein type 9 subunit alpha
Name:Sodium channel protein type 9 subunit alpha
Type:Protein
Mol. Mass.:226375.97
Organism:Homo sapiens (Human)
Description:Q15858
Residue:1988
BDBM258179
NameBDBM258179
Synonyms:US9493448, 84 US9845313, Example 84
TypeSmall organic molecule
Emp. Form.C21H22F3N5O3S
Mol. Mass.481.491
SMILESCc1c(O[C@H]2CC(F)(F)CC[C@@H]2c2ccnn2C)ccc(c1F)S(=O)(=O)Nc1ccncn1