Reaction Details
TargetSodium channel protein type 9 subunit alpha
LigandBDBM258201
Substrate/Competitorn/a
Meas. Tech.Electrophysiological Assay
pH7.3±n/a
Temperature310.15±n/a K
IC50 42±n/a nM
Commentsextracted
Citation Shinozuka, TKobayashi, HSuzuki, STanaka, KKimoto, HDomon, Y Cycloalkane derivatives US Patent US9493448 Publication Date 11/15/2016
 
Sodium channel protein type 9 subunit alpha
Name:Sodium channel protein type 9 subunit alpha
Type:Protein
Mol. Mass.:226375.97
Organism:Homo sapiens (Human)
Description:Q15858
Residue:1988
BDBM258201
NameBDBM258201
Synonyms:US9493448, 107 US9845313, Example 107
TypeSmall organic molecule
Emp. Form.C19H17F4N5O3S
Mol. Mass.471.429
SMILESCn1nccc1[C@H]1CC(F)(F)C[C@@H]1Oc1cc(F)c(cc1F)S(=O)(=O)Nc1ccncn1