Reaction Details
TargetSodium channel protein type 9 subunit alpha
LigandBDBM258238
Substrate/Competitorn/a
Meas. Tech.Electrophysiological Assay
pH7.3±n/a
Temperature310.15±n/a K
IC50 24±n/a nM
Commentsextracted
Citation Shinozuka, TKobayashi, HSuzuki, STanaka, KKimoto, HDomon, Y Cycloalkane derivatives US Patent US9493448 Publication Date 11/15/2016
 
Sodium channel protein type 9 subunit alpha
Name:Sodium channel protein type 9 subunit alpha
Type:Protein
Mol. Mass.:226375.97
Organism:Homo sapiens (Human)
Description:Q15858
Residue:1988
BDBM258238
NameBDBM258238
Synonyms:US9493448, 146 US9845313, Example 146
TypeSmall organic molecule
Emp. Form.C19H17ClF3N5O3S
Mol. Mass.487.883
SMILESCn1nccc1[C@H]1CC(F)(F)C[C@@H]1Oc1cc(F)c(cc1Cl)S(=O)(=O)Nc1ccncn1