Reaction Details
TargetSodium channel protein type 9 subunit alpha
LigandBDBM258233
Substrate/Competitorn/a
Meas. Tech.Electrophysiological Assay
pH7.3±n/a
Temperature310.15±n/a K
IC50 21±n/a nM
Commentsextracted
Citation Shinozuka, TKobayashi, HSuzuki, STanaka, KKimoto, HDomon, Y Cycloalkane derivatives US Patent US9493448 Publication Date 11/15/2016
 
Sodium channel protein type 9 subunit alpha
Name:Sodium channel protein type 9 subunit alpha
Type:Protein
Mol. Mass.:226375.97
Organism:Homo sapiens (Human)
Description:Q15858
Residue:1988
BDBM258233
NameBDBM258233
Synonyms:US9493448, 140 US9597330, Example 51 | US9845313, Example 150
TypeSmall organic molecule
Emp. Form.C18H17ClFN5O3S
Mol. Mass.437.876
SMILESFc1cc(O[C@H]2CCC[C@@H]2c2ccn[nH]2)c(Cl)cc1S(=O)(=O)Nc1ccncn1