Reaction Details
TargetD-amino-acid oxidase
LigandBDBM258351
Substrate/Competitorn/a
Meas. Tech.In Vitro Assay
pH8.5±n/a
Temperature298.15±n/a K
IC50 300±n/a nM
Commentsextracted
Citation Tsukamoto, TSlusher, BSFerraris, DVRojas, CHin, NDuvall, B Inhibitors of D-amino acid oxidase US Patent US9505753 Publication Date 11/29/2016
 
D-amino-acid oxidase
Name:D-amino-acid oxidase
Type:Flavoprotein
Mol. Mass.:39338.01
Organism:Sus scrofa (pig)
Description:Homodimer.
Residue:347
BDBM258351
NameBDBM258351
Synonyms:US9505753, 10t
TypeSmall organic molecule
Emp. Form.C13H15N3O4
Mol. Mass.277.2759
SMILESCCOc1ccc(CCn2nc(O)c(=O)[nH]c2=O)cc1