Reaction Details
TargetSphingosine 1-phosphate receptor 1
LigandBDBM65043
Substrate/Competitorn/a
Meas. Tech.Binding Assay
pH7.5±n/a
Temperature298.15±n/a K
IC50<10±n/a nM
Commentsextracted
Citation Dyckman, AJDhar, TGXiao, HGilmore, JLYang, MGXiao, ZMarcoux, D Substituted bicyclic compounds US Patent US9522888 Publication Date 12/20/2016
 
Sphingosine 1-phosphate receptor 1
Name:Sphingosine 1-phosphate receptor 1
Type:Enzyme
Mol. Mass.:42836.02
Organism:Homo sapiens (Human)
Description:P21453
Residue:382
BDBM65043
NameBDBM65043
Synonyms:US9522888, 414
Typen/a
Emp. Form.C19H30NO7P
Mol. Mass.415.4178
SMILESCCCCOC[C@@H]1COc2cc(ccc2O1)[C@H]1CC[C@](N)(COP(O)(O)=O)C1