Reaction Details
TargetSphingosine 1-phosphate receptor 1
LigandBDBM65068
Substrate/Competitorn/a
Meas. Tech.Binding Assay
pH7.5±n/a
Temperature298.15±n/a K
IC50<10±n/a nM
Commentsextracted
Citation Dyckman, AJDhar, TGXiao, HGilmore, JLYang, MGXiao, ZMarcoux, D Substituted bicyclic compounds US Patent US9522888 Publication Date 12/20/2016
 
Sphingosine 1-phosphate receptor 1
Name:Sphingosine 1-phosphate receptor 1
Type:Enzyme
Mol. Mass.:42836.02
Organism:Homo sapiens (Human)
Description:P21453
Residue:382
BDBM65068
NameBDBM65068
Synonyms:US10166249, Example 437 US9522888, 440
Typen/a
Emp. Form.C22H34NO5P
Mol. Mass.423.4828
SMILESCCC\C=C/CO[C@H]1CCc2cc(ccc2C1)[C@H]1CC[C@](N)(COP(O)(O)=O)C1