Reaction Details
TargetSphingosine 1-phosphate receptor 1
LigandBDBM65085
Substrate/Competitorn/a
Meas. Tech.Binding Assay
pH7.5±n/a
Temperature298.15±n/a K
IC50<10±n/a nM
Commentsextracted
Citation Dyckman, AJDhar, TGXiao, HGilmore, JLYang, MGXiao, ZMarcoux, D Substituted bicyclic compounds US Patent US9522888 Publication Date 12/20/2016
 
Sphingosine 1-phosphate receptor 1
Name:Sphingosine 1-phosphate receptor 1
Type:Enzyme
Mol. Mass.:42836.02
Organism:Homo sapiens (Human)
Description:P21453
Residue:382
BDBM65085
NameBDBM65085
Synonyms:US10166249, Example 451 | US9522888, 451
Typen/a
Emp. Form.C21H31F3NO5P
Mol. Mass.465.4435
SMILESN[C@]1(COP(O)(O)=O)CC[C@@H](C1)c1ccc2C[C@H](COCCCC(F)(F)F)CCc2c1