Reaction Details
TargetSphingosine 1-phosphate receptor 1
LigandBDBM65086
Substrate/Competitorn/a
Meas. Tech.Binding Assay
pH7.5±n/a
Temperature298.15±n/a K
IC50<10±n/a nM
Commentsextracted
Citation Dyckman, AJDhar, TGXiao, HGilmore, JLYang, MGXiao, ZMarcoux, D Substituted bicyclic compounds US Patent US9522888 Publication Date 12/20/2016
 
Sphingosine 1-phosphate receptor 1
Name:Sphingosine 1-phosphate receptor 1
Type:Enzyme
Mol. Mass.:42836.02
Organism:Homo sapiens (Human)
Description:P21453
Residue:382
BDBM65086
NameBDBM65086
Synonyms:US10166249, Example 452 | US9522888, 452
Typen/a
Emp. Form.C21H32NO5P
Mol. Mass.409.4562
SMILESN[C@]1(COP(O)(O)=O)CC[C@@H](C1)c1ccc2C[C@H](COCCC=C)CCc2c1