Reaction Details
TargetSphingosine 1-phosphate receptor 1
LigandBDBM65350
Substrate/Competitorn/a
Meas. Tech.hS1P1ERK Phosphorylation Assay
Temperature310.15±n/a K
EC50<10±n/a nM
Commentsextracted
Citation Dyckman, AJDhar, TGXiao, HGilmore, JLYang, MGXiao, ZMarcoux, D Substituted bicyclic compounds US Patent US9522888 Publication Date 12/20/2016
 
Sphingosine 1-phosphate receptor 1
Name:Sphingosine 1-phosphate receptor 1
Type:Enzyme
Mol. Mass.:42836.02
Organism:Homo sapiens (Human)
Description:P21453
Residue:382
BDBM65350
NameBDBM65350
Synonyms:US10166249, Example 658 | US9522888, 658
Typen/a
Emp. Form.C22H34NO4P
Mol. Mass.407.4834
SMILESCC\C=C\CC[C@H]1CCc2cc(ccc2C1)[C@H]1CC[C@](N)(COP(O)(O)=O)C1