Reaction Details
TargetSphingosine 1-phosphate receptor 1
LigandBDBM65360
Substrate/Competitorn/a
Meas. Tech.hS1P1ERK Phosphorylation Assay
Temperature310.15±n/a K
EC50 55±n/a nM
Commentsextracted
Citation Dyckman, AJDhar, TGXiao, HGilmore, JLYang, MGXiao, ZMarcoux, D Substituted bicyclic compounds US Patent US9522888 Publication Date 12/20/2016
 
Sphingosine 1-phosphate receptor 1
Name:Sphingosine 1-phosphate receptor 1
Type:Enzyme
Mol. Mass.:42836.02
Organism:Homo sapiens (Human)
Description:P21453
Residue:382
BDBM65360
NameBDBM65360
Synonyms:US10166249, Example 668 | US9522888, 668
Typen/a
Emp. Form.C21H34NO5PS
Mol. Mass.443.537
SMILESCCCCS(=O)C[C@@H]1CCc2cc(ccc2C1)[C@H]1CC[C@](N)(COP(O)(O)=O)C1