Reaction Details
TargetSphingosine 1-phosphate receptor 1
LigandBDBM258474
Substrate/Competitorn/a
Meas. Tech.Binding Assay
pH7.5±n/a
Temperature298.15±n/a K
IC50 3.0±n/a nM
Commentsextracted
Citation Dyckman, AJDhar, TGXiao, HGilmore, JLYang, MGXiao, ZMarcoux, D Substituted bicyclic compounds US Patent US9522888 Publication Date 12/20/2016
 
Sphingosine 1-phosphate receptor 1
Name:Sphingosine 1-phosphate receptor 1
Type:Enzyme
Mol. Mass.:42836.02
Organism:Homo sapiens (Human)
Description:P21453
Residue:382
BDBM258474
NameBDBM258474
Synonyms:US9522888, 690
TypeSmall organic molecule
Emp. Form.C22H36NO5P
Mol. Mass.425.4987
SMILESCOCCCCC[C@H]1CCc2cc(ccc2C1)[C@H]1CC[C@@](N)(COP(O)(O)=O)C1